Reaction Details
TargetAlpha-1A adrenergic receptor
LigandBDBM50001817
Substrate/Competitorn/a
Meas. Tech.ChEBML_33271
IC50 89±n/a nM
Citation Andersen, KPerregaard, JArnt, JNielsen, JBBegtrup, M Selective, centrally acting serotonin 5-HT2 antagonists. 2. Substituted 3-(4-fluorophenyl)-1H-indoles. J Med Chem35:4823-31 (1993) Alpha-1A adrenergic receptor
Name:Alpha-1A adrenergic receptor
Type:Protein
Mol. Mass.:51620.15
Organism:Rattus norvegicus (Rat)
Description:P43140
Residue:466
BDBM50001817
NameBDBM50001817
Synonyms:3-(2-{4-[3-(4-Fluoro-phenyl)-5-methyl-indol-1-yl]-piperidin-1-yl}-ethyl)-1,1-dimethyl-urea | CHEMBL144710
TypeSmall organic molecule
Emp. Form.C25H31FN4O
Mol. Mass.422.5382
SMILESCN(C)C(=O)NCCN1CCC(CC1)n1cc(-c2ccc(F)cc2)c2cc(C)ccc12