Reaction Details
TargetSerotonin 2 (5-HT2) receptor
LigandBDBM50001808
Substrate/Competitorn/a
Meas. Tech.ChEMBL_1908 (CHEMBL616503)
IC50 2.7±n/a nM
Citation Andersen, KPerregaard, JArnt, JNielsen, JBBegtrup, M Selective, centrally acting serotonin 5-HT2 antagonists. 2. Substituted 3-(4-fluorophenyl)-1H-indoles. J Med Chem35:4823-31 (1993) Serotonin 2 (5-HT2) receptor
Name:Serotonin 2 (5-HT2) receptor
Synonyms:5-hydroxytryptamine receptor 2A/2B/2C
Type:n/a
Mol. Mass.:n/a
Description:ASSAY_ID of ChEMBL is 2197419
Components:This complex has 3 components.
Component 1
Name:5-hydroxytryptamine receptor 2B
Type:Enzyme Catalytic Domain
Mol. Mass.:53668.47
Organism:RAT
Description:5-HT2B HTR2B RAT::P30994
Residue:479
Component 2
Name:5-hydroxytryptamine receptor 2C
Synonyms:5-HT2C 5-hydroxytryptamine receptor 2C (5HT2c) 5ht1c Htr2c Serotonin receptor 2a and 2c (5HT2A and 5HT2C)
Type:Enzyme
Mol. Mass.:51935.10
Organism:Rattus norvegicus (Rat)
Description:P08909
Residue:460
Component 3
Name:5-hydroxytryptamine receptor 2A
Synonyms:5-HT-2A 5-HT2A 5-hydroxytryptamine receptor 2A (5HT2A) Htr2 Serotonin Receptor 2A
Type:G Protein-Coupled Receptor (GPCR)
Mol. Mass.:52852.05
Organism:Rattus norvegicus (rat)
Description:Rat cortex membranes 5-HT2A receptors.
Residue:471
BDBM50001808
NameBDBM50001808
Synonyms:1-(2-{4-[3-(4-Fluoro-phenyl)-5-methyl-indol-1-yl]-piperidin-1-yl}-ethyl)-3-isopropyl-imidazolidin-2-one | CHEMBL145712
TypeSmall organic molecule
Emp. Form.C28H35FN4O
Mol. Mass.462.6021
SMILESCC(C)N1CCN(CCN2CCC(CC2)n2cc(-c3ccc(F)cc3)c3cc(C)ccc23)C1=O