Reaction Details
TargetMitogen-activated protein kinase 14
LigandBDBM50241022
Substrate/Competitorn/a
Meas. Tech.ChEMBL_1669514 (CHEMBL4019402)
IC50 2.6±n/a nM
Citation Walter, NMWentsch, HKBührmann, MBauer, SMDöring, EMayer-Wrangowski, SSievers-Engler, AWillemsen-Seegers, NZaman, GBuijsman, RLämmerhofer, MRauh, DLaufer, SA Design, Synthesis, and Biological Evaluation of Novel Type I J Med Chem60:8027-8054 (2017) 
 
Mitogen-activated protein kinase 14
Name:Mitogen-activated protein kinase 14
Type:Serine/threonine-protein kinase
Mol. Mass.:41286.76
Organism:Homo sapiens (Human)
Description:Q16539
Residue:360
BDBM50241022
NameBDBM50241022
Synonyms:CHEMBL4066610
TypeSmall organic molecule
Emp. Form.C29H23F2N3O6S
Mol. Mass.579.571
SMILESOCC(CO)NC(=O)c1ccc2COc3cc(Nc4cc(NC(=O)c5cccs5)c(F)cc4F)ccc3C(=O)c2c1