Reaction Details
TargetMitogen-activated protein kinase 14
LigandBDBM50241044
Substrate/Competitorn/a
Meas. Tech.ChEMBL_1669518 (CHEMBL4019406)
Kd 2.0±n/a nM
Citation Walter, NMWentsch, HKBührmann, MBauer, SMDöring, EMayer-Wrangowski, SSievers-Engler, AWillemsen-Seegers, NZaman, GBuijsman, RLämmerhofer, MRauh, DLaufer, SA Design, Synthesis, and Biological Evaluation of Novel Type I J Med Chem60:8027-8054 (2017) 
 
Mitogen-activated protein kinase 14
Name:Mitogen-activated protein kinase 14
Type:Serine/threonine-protein kinase
Mol. Mass.:41286.76
Organism:Homo sapiens (Human)
Description:Q16539
Residue:360
BDBM50241044
NameBDBM50241044
Synonyms:CHEMBL4078249
TypeSmall organic molecule
Emp. Form.C30H26FN3O5S
Mol. Mass.559.608
SMILESOCC(O)CNC(=O)c1ccc2CCc3cc(Nc4ccc(F)c(NC(=O)c5cccs5)c4)ccc3C(=O)c2c1