Reaction Details
TargetMitogen-activated protein kinase 14
LigandBDBM50241047
Substrate/Competitorn/a
Meas. Tech.ChEMBL_1669516 (CHEMBL4019404)
IC50 69±n/a nM
Citation Walter, NMWentsch, HKBührmann, MBauer, SMDöring, EMayer-Wrangowski, SSievers-Engler, AWillemsen-Seegers, NZaman, GBuijsman, RLämmerhofer, MRauh, DLaufer, SA Design, Synthesis, and Biological Evaluation of Novel Type I J Med Chem60:8027-8054 (2017) 
 
Mitogen-activated protein kinase 14
Name:Mitogen-activated protein kinase 14
Type:Serine/threonine-protein kinase
Mol. Mass.:41286.76
Organism:Homo sapiens (Human)
Description:Q16539
Residue:360
BDBM50241047
NameBDBM50241047
Synonyms:CHEMBL4102537
TypeSmall organic molecule
Emp. Form.C32H33FN4O4
Mol. Mass.556.6272
SMILESFc1ccc(Nc2ccc3c(CCc4ccc(cc4C3=O)C(=O)NCCN3CCOCC3)c2)cc1NC(=O)C1CC1