Reaction Details
TargetMitogen-activated protein kinase 14
LigandBDBM50241063
Substrate/Competitorn/a
Meas. Tech.ChEMBL_1669514 (CHEMBL4019402)
IC50 1.4±n/a nM
Citation Walter, NMWentsch, HKBührmann, MBauer, SMDöring, EMayer-Wrangowski, SSievers-Engler, AWillemsen-Seegers, NZaman, GBuijsman, RLämmerhofer, MRauh, DLaufer, SA Design, Synthesis, and Biological Evaluation of Novel Type I J Med Chem60:8027-8054 (2017) 
 
Mitogen-activated protein kinase 14
Name:Mitogen-activated protein kinase 14
Type:Serine/threonine-protein kinase
Mol. Mass.:41286.76
Organism:Homo sapiens (Human)
Description:Q16539
Residue:360
BDBM50241063
NameBDBM50241063
Synonyms:CHEMBL4074639
TypeSmall organic molecule
Emp. Form.C28H20FN3O4
Mol. Mass.481.4745
SMILESNC(=O)c1ccc2COc3cc(Nc4ccc(F)c(NC(=O)c5ccccc5)c4)ccc3C(=O)c2c1