Reaction Details
TargetMitogen-activated protein kinase 14
LigandBDBM50240996
Substrate/Competitorn/a
Meas. Tech.ChEMBL_1669514 (CHEMBL4019402)
IC50 1.000000±n/a nM
Citation Walter, NMWentsch, HKBührmann, MBauer, SMDöring, EMayer-Wrangowski, SSievers-Engler, AWillemsen-Seegers, NZaman, GBuijsman, RLämmerhofer, MRauh, DLaufer, SA Design, Synthesis, and Biological Evaluation of Novel Type I J Med Chem60:8027-8054 (2017) 
 
Mitogen-activated protein kinase 14
Name:Mitogen-activated protein kinase 14
Type:Serine/threonine-protein kinase
Mol. Mass.:41286.76
Organism:Homo sapiens (Human)
Description:Q16539
Residue:360
BDBM50240996
NameBDBM50240996
Synonyms:CHEMBL4095093
TypeSmall organic molecule
Emp. Form.C34H31FN4O5
Mol. Mass.594.6321
SMILESFc1ccc(Nc2ccc3c(OCc4ccc(cc4C3=O)C(=O)NCCN3CCOCC3)c2)cc1NC(=O)c1ccccc1