Reaction Details
TargetMitogen-activated protein kinase 14
LigandBDBM50241045
Substrate/Competitorn/a
Meas. Tech.ChEMBL_1669514 (CHEMBL4019402)
IC50 0.600000±n/a nM
Citation Walter, NMWentsch, HKBührmann, MBauer, SMDöring, EMayer-Wrangowski, SSievers-Engler, AWillemsen-Seegers, NZaman, GBuijsman, RLämmerhofer, MRauh, DLaufer, SA Design, Synthesis, and Biological Evaluation of Novel Type I J Med Chem60:8027-8054 (2017) 
 
Mitogen-activated protein kinase 14
Name:Mitogen-activated protein kinase 14
Type:Serine/threonine-protein kinase
Mol. Mass.:41286.76
Organism:Homo sapiens (Human)
Description:Q16539
Residue:360
BDBM50241045
NameBDBM50241045
Synonyms:CHEMBL4103539
TypeSmall organic molecule
Emp. Form.C33H31FN4O4S
Mol. Mass.598.687
SMILESFc1ccc(NC(=O)c2cccs2)cc1Nc1ccc2c(CCc3ccc(cc3C2=O)C(=O)NCCN2CCOCC2)c1