Reaction Details
TargetBeta-1 adrenergic receptor
LigandBDBM50002134
Substrate/Competitorn/a
Meas. Tech.ChEMBL_37533 (CHEMBL647376)
IC50 1300000±n/a nM
Citation Bloom, JDDutia, MDJohnson, BDWissner, ABurns, MGLargis, EEDolan, JAClaus, TH Disodium (R,R)-5-[2-[[2-(3-chlorophenyl)-2-hydroxyethyl]-amino] propyl]-1,3-benzodioxole-2,2-dicarboxylate (CL 316,243). A potent beta-adrenergic agonist virtually specific for beta 3 receptors. A promising antidiabetic and antiobesity agent. J Med Chem35:3081-4 (1992) Beta-1 adrenergic receptor
Name:Beta-1 adrenergic receptor
Type:Protein
Mol. Mass.:50486.84
Organism:Rattus norvegicus (Rat)
Description:P18090
Residue:466
BDBM50002134
NameBDBM50002134
Synonyms:5-((2R)-2-{[(2R)-2-(3-chlorophenyl)-2-hydroxyethyl]amino}propyl)-1,3-benzodioxole-2,2-dicarboxylate 5-{2-[2-(3-Chloro-phenyl)-2-hydroxy-ethylamino]-propyl}-benzo[1,3]dioxole-2,2-dicarboxylic acid;Disodium salt CL-316243 disodium 5-((2R)-2-{[(2R)-2-(3-chlorophenyl)-2-hydroxyethyl]amino}propyl)-1,3-benzodioxole-2,2-dicarboxylate | disodium 5-[2-[2-(3-chlorophenyl)-2-hydroxyethylamino]-(2R)-propyl]benzo[d][1,3]dioxole-2,2-dicarboxylate(CL 316,243)
TypeSmall organic molecule
Emp. Form.C20H18ClNO7
Mol. Mass.419.814
SMILESC[C@H](Cc1ccc2OC(Oc2c1)(C([O-])=O)C([O-])=O)NC[C@H](O)c1cccc(Cl)c1