Reaction Details
TargetDelta-type opioid receptor
LigandBDBM50002186
Substrate/Competitorn/a
Meas. Tech.ChEBML_146596
Ki 1.3±n/a nM
Citation Snyder, KRStory, SCHeidt, MEMurray, TFDeLander, GEAldrich, JV Effect of modification of the basic residues of dynorphin A-(1-13) amide on kappa opioid receptor selectivity and opioid activity. J Med Chem35:4330-3 (1992) Delta-type opioid receptor
Name:Delta-type opioid receptor
Type:G Protein-Coupled Receptor (GPCR)
Mol. Mass.:40465.04
Organism:Rattus norvegicus (rat)
Description:Competition binding assays were using CHO-K1 cell membranes expressing the opioid receptor.
Residue:372
BDBM50002186
NameBDBM50002186
Synonyms:CHEMBL440987 | Tyr-Gly-Gly-Phe-Leu-Arg-Arg-Ile-Lys(Ac)-Pro-Lys-Leu-Lys
TypeSmall organic molecule
Emp. Form.C77H129N23O15
Mol. Mass.1616.9933
SMILESCC[C@H](C)[C@H](NC(=O)[C@H](CCCNC(N)=N)NC(=O)[C@H](CCCNC(N)=N)NC(=O)[C@H](CC(C)C)NC(=O)[C@H](Cc1ccccc1)NC(=O)CNC(=O)CNC(=O)[C@@H](N)Cc1ccc(O)cc1)C(=O)N[C@@H](CCCCNC(C)=O)C(=O)N1CCC[C@H]1C(=O)N[C@@H](CCCCN)C(=O)N[C@@H](CC(C)C)C(=O)N[C@@H](CCCCN)C(N)=O