Reaction Details
TargetHistone deacetylase 1
LigandBDBM50241906
Substrate/Competitorn/a
Meas. Tech.ChEMBL_1670958 (CHEMBL4020987)
IC50 1.3±n/a nM
Citation Mehndiratta, SWang, RSHuang, HLSu, CJHsu, CMWu, YWPan, SLLiou, JP 4-Indolyl-N-hydroxyphenylacrylamides as potent HDAC class I and IIB inhibitors in vitro and in vivo. Eur J Med Chem134:13-23 (2017) 
 
Histone deacetylase 1
Name:Histone deacetylase 1
Type:Enzyme
Mol. Mass.:55090.27
Organism:Homo sapiens (Human)
Description:Q13547
Residue:482
BDBM50241906
NameBDBM50241906
Synonyms:CHEMBL4069853
TypeSmall organic molecule
Emp. Form.C19H19N3O4S
Mol. Mass.385.437
SMILESONC(=O)\C=C\c1ccc(cc1)S(=O)(=O)NCCc1cccc2[nH]ccc12