Reaction Details
TargetAcetylcholinesterase
LigandBDBM50027343
Substrate/Competitorn/a
Meas. Tech.ChEMBL_1671087 (CHEMBL4021116)
Kd 2200±n/a nM
Citation Mohammed, ASneathen, JFrojen, SGKuo, LDupureur, CM Stereospecific cholinesterase inhibition by O,S-diethylphenylphosphonothioate. Bioorg Med Chem25:3053-3058 (2017) 
 
Acetylcholinesterase
Name:Acetylcholinesterase
Type:Enzyme
Mol. Mass.:71812.79
Organism:Electrophorus electricus (Electric eel)
Description:n/a
Residue:633
BDBM50027343
NameBDBM50027343
Synonyms:CHEBI:75701 | ISOPROPYL METHYLPHOSPHONOFLUORIDATE
TypeSmall organic molecule
Emp. Form.C4H10FO2P
Mol. Mass.140.0932
SMILESCC(C)OP(C)(F)=O