Reaction Details
TargetSubstance-P receptor
LigandBDBM50002453
Substrate/Competitorn/a
Meas. Tech.ChEBML_208650
IC50 4200±n/a nM
Citation Lawrence, KBVenepalli, BRAppell, KCGoswami, RLogan, METomczuk, BEYanni, JM Synthesis and substance P antagonist activity of naphthimidazolium derivatives. J Med Chem35:1273-9 (1992) Substance-P receptor
Name:Substance-P receptor
Type:G Protein-Coupled Receptor (GPCR)
Mol. Mass.:46371.54
Organism:Rattus norvegicus (rat)
Description:Competition binding assays were carried out using membrane preparations from transfected CHO cells that constitutively expressed the rat NK1 receptor.
Residue:407
BDBM50002453
NameBDBM50002453
Synonyms:10-Ethyl-1-[2-(3-ethyl-3H-benzooxazol-2-ylidene)-ethylidene]-1,2,3,10-tetrahydro-10-aza-3a-azonia-pentaleno[1,2-b]naphthalene; iodide | CHEMBL23533
TypeSmall organic molecule
Emp. Form.C27H26N3O
Mol. Mass.408.5143
SMILESCCN1\C(Oc2ccccc12)=C/C=C1CC[n+]2c1n(CC)c1cc3ccccc3cc21