Reaction Details
TargetSubstance-P receptor
LigandBDBM50002454
Substrate/Competitorn/a
Meas. Tech.ChEBML_208650
IC50 500±n/a nM
Citation Lawrence, KBVenepalli, BRAppell, KCGoswami, RLogan, METomczuk, BEYanni, JM Synthesis and substance P antagonist activity of naphthimidazolium derivatives. J Med Chem35:1273-9 (1992) Substance-P receptor
Name:Substance-P receptor
Type:G Protein-Coupled Receptor (GPCR)
Mol. Mass.:46371.54
Organism:Rattus norvegicus (rat)
Description:Competition binding assays were carried out using membrane preparations from transfected CHO cells that constitutively expressed the rat NK1 receptor.
Residue:407
BDBM50002454
NameBDBM50002454
Synonyms:CHEMBL386306 | D-Lys(Nicotinoyl)-Pro(3-Pyridyl)-Ala-Pro(3,4-dichloro)-D-Phe-Asn-D-Trp-Phe-D-Trp-Leu-Nle (Spantide)
TypeSmall organic molecule
Emp. Form.C86H103Cl2N17O14
Mol. Mass.1669.75
SMILESCCCC[C@H](NC(=O)[C@H](CC(C)C)NC(=O)[C@H](Cc1c[nH]c2ccccc12)NC(=O)[C@H](Cc1ccccc1)NC(=O)[C@H](Cc1c[nH]c2ccccc12)NC(=O)[C@H](CC(N)=O)NC(=O)[C@H](Cc1ccccc1)NC(=O)[C@@H]1C(Cl)C(Cl)CN1C(=O)[C@H](C)NC(=O)[C@@H]1C(CCN1C(=O)[C@H](CCCCN)NC(=O)c1cccnc1)c1cccnc1)C(O)=O