Reaction Details
TargetSubstance-P receptor
LigandBDBM50002456
Substrate/Competitorn/a
Meas. Tech.ChEBML_208650
IC50 320±n/a nM
Citation Lawrence, KBVenepalli, BRAppell, KCGoswami, RLogan, METomczuk, BEYanni, JM Synthesis and substance P antagonist activity of naphthimidazolium derivatives. J Med Chem35:1273-9 (1992) Substance-P receptor
Name:Substance-P receptor
Type:G Protein-Coupled Receptor (GPCR)
Mol. Mass.:46371.54
Organism:Rattus norvegicus (rat)
Description:Competition binding assays were carried out using membrane preparations from transfected CHO cells that constitutively expressed the rat NK1 receptor.
Residue:407
BDBM50002456
NameBDBM50002456
Synonyms:1,3-Diethyl-2-[3-(3-ethyl-3H-benzothiazol-2-ylidene)-propenyl]-3H-naphtho[2,3-d]imidazol-1-ium; iodide | CHEMBL23287
TypeSmall organic molecule
Emp. Form.C27H28N3S
Mol. Mass.426.596
SMILESCCN1\C(Sc2ccccc12)=C/C=C/c1n(CC)c2cc3ccccc3cc2[n+]1CC