Reaction Details
TargetSubstance-P receptor
LigandBDBM50002457
Substrate/Competitorn/a
Meas. Tech.ChEBML_208650
IC50 410±n/a nM
Citation Lawrence, KBVenepalli, BRAppell, KCGoswami, RLogan, METomczuk, BEYanni, JM Synthesis and substance P antagonist activity of naphthimidazolium derivatives. J Med Chem35:1273-9 (1992) Substance-P receptor
Name:Substance-P receptor
Type:G Protein-Coupled Receptor (GPCR)
Mol. Mass.:46371.54
Organism:Rattus norvegicus (rat)
Description:Competition binding assays were carried out using membrane preparations from transfected CHO cells that constitutively expressed the rat NK1 receptor.
Residue:407
BDBM50002457
NameBDBM50002457
Synonyms:1-(2-Acetoxy-ethyl)-3-ethyl-2-[3-(1,3,3-trimethyl-1,3-dihydro-indol-2-ylidene)-propenyl]-3H-naphtho[2,3-d]imidazol-1-ium; chloride | CHEMBL23073
TypeSmall organic molecule
Emp. Form.C31H34N3O2
Mol. Mass.480.62
SMILESCCn1c(\C=C\C=C2/N(C)c3ccccc3C2(C)C)[n+](CCOC(C)=O)c2cc3ccccc3cc12