Reaction Details
TargetSubstance-P receptor
LigandBDBM50002461
Substrate/Competitorn/a
Meas. Tech.ChEBML_208650
IC50 180±n/a nM
Citation Lawrence, KBVenepalli, BRAppell, KCGoswami, RLogan, METomczuk, BEYanni, JM Synthesis and substance P antagonist activity of naphthimidazolium derivatives. J Med Chem35:1273-9 (1992) Substance-P receptor
Name:Substance-P receptor
Type:G Protein-Coupled Receptor (GPCR)
Mol. Mass.:46371.54
Organism:Rattus norvegicus (rat)
Description:Competition binding assays were carried out using membrane preparations from transfected CHO cells that constitutively expressed the rat NK1 receptor.
Residue:407
BDBM50002461
NameBDBM50002461
Synonyms:10-Ethyl-1-[2-(3-ethyl-3H-benzothiazol-2-ylidene)-ethylidene]-3-methyl-1,2,3,10-tetrahydro-10-aza-3a-azonia-pentaleno[1,2-b]naphthalene; iodide | CHEMBL23096
TypeSmall organic molecule
Emp. Form.C28H28N3S
Mol. Mass.438.606
SMILESCCN1\C(Sc2ccccc12)=C/C=C1CC(C)[n+]2c1n(CC)c1cc3ccccc3cc21