Reaction Details
TargetSubstance-P receptor
LigandBDBM50002463
Substrate/Competitorn/a
Meas. Tech.ChEBML_208650
IC50 2000±n/a nM
Citation Lawrence, KBVenepalli, BRAppell, KCGoswami, RLogan, METomczuk, BEYanni, JM Synthesis and substance P antagonist activity of naphthimidazolium derivatives. J Med Chem35:1273-9 (1992) Substance-P receptor
Name:Substance-P receptor
Type:G Protein-Coupled Receptor (GPCR)
Mol. Mass.:46371.54
Organism:Rattus norvegicus (rat)
Description:Competition binding assays were carried out using membrane preparations from transfected CHO cells that constitutively expressed the rat NK1 receptor.
Residue:407
BDBM50002463
NameBDBM50002463
Synonyms:1,3-Diethyl-2-[3-(1-methyl-1H-benzo[cd]indol-2-ylidene)-propenyl]-3H-naphtho[2,3-d]imidazol-1-ium; chloride | CHEMBL23181
TypeSmall organic molecule
Emp. Form.C30H28N3
Mol. Mass.430.5629
SMILESCCn1c(\C=C\C=c2/n(C)c3cccc4cccc2c34)[n+](CC)c2cc3ccccc3cc12