Reaction Details
TargetSubstance-P receptor
LigandBDBM50002462
Substrate/Competitorn/a
Meas. Tech.ChEBML_208650
IC50 510±n/a nM
Citation Lawrence, KBVenepalli, BRAppell, KCGoswami, RLogan, METomczuk, BEYanni, JM Synthesis and substance P antagonist activity of naphthimidazolium derivatives. J Med Chem35:1273-9 (1992) Substance-P receptor
Name:Substance-P receptor
Type:G Protein-Coupled Receptor (GPCR)
Mol. Mass.:46371.54
Organism:Rattus norvegicus (rat)
Description:Competition binding assays were carried out using membrane preparations from transfected CHO cells that constitutively expressed the rat NK1 receptor.
Residue:407
BDBM50002462
NameBDBM50002462
Synonyms:1,3-Diethyl-2-[3-(1,3,3-trimethyl-1,3-dihydro-indol-2-ylidene)-propenyl]-3H-imidazo[4,5-b]quinoxalin-1-ium; chloride CHEMBL278294
TypeSmall organic molecule
Emp. Form.C27H30N5
Mol. Mass.424.5601
SMILESCCn1c(\C=C\C=C2/N(C)c3ccccc3C2(C)C)[n+](CC)c2nc3ccccc3nc12