Reaction Details
TargetFolylpolyglutamate synthase, mitochondrial
LigandBDBM50002472
Substrate/Competitorn/a
Meas. Tech.ChEMBL_68381 (CHEMBL678790)
Ki 8300.0±n/a nM
Citation Singh, SKSinger, SCFerone, RWaters, KAMullin, RJHynes, JB Synthesis and biological evaluation of N alpha-(5-deaza-5,6,7,8-tetrahydropteroyl)-L-ornithine. J Med Chem35:2002-6 (1992) Folylpolyglutamate synthase, mitochondrial
Name:Folylpolyglutamate synthase, mitochondrial
Type:PROTEIN
Mol. Mass.:64621.95
Organism:Homo sapiens (Human)
Description:ChEMBL_68676
Residue:587
BDBM50002472
NameBDBM50002472
Synonyms:5-Amino-2-{4-[(2-amino-5-chloro-4-oxo-3,4-dihydro-quinazolin-6-ylmethyl)-amino]-benzoylamino}-pentanoic acid | CHEMBL288142
TypeSmall organic molecule
Emp. Form.C21H23ClN6O4
Mol. Mass.458.898
SMILESNCCCC(NC(=O)c1ccc(NCc2ccc3nc(N)[nH]c(=O)c3c2Cl)cc1)C(O)=O