Reaction Details
TargetCarbonic anhydrase 2
LigandBDBM50242147
Substrate/Competitorn/a
Meas. Tech.ChEBML_1671362
Ki>10000±n/a nM
Citation Ivanova, JCarta, FVullo, DLeitans, JKazaks, ATars, K?alubovskis, RSupuran, CT N-Substituted and ring opened saccharin derivatives selectively inhibit transmembrane, tumor-associated carbonic anhydrases IX and XII. Bioorg Med Chem25:3583-3589 (2017) 
 
Carbonic anhydrase 2
Name:Carbonic anhydrase 2
Type:Enzyme
Mol. Mass.:29250.71
Organism:Homo sapiens (Human)
Description:P00918
Residue:260
BDBM50242147
NameBDBM50242147
Synonyms:CHEMBL4072571
TypeSmall organic molecule
Emp. Form.C10H11NO3S
Mol. Mass.225.264
SMILESCCCN1C(=O)c2ccccc2S1(=O)=O