Reaction Details
TargetCarbonic anhydrase 12
LigandBDBM50242151
Substrate/Competitorn/a
Meas. Tech.ChEMBL_1671364 (CHEMBL4021393)
Ki 75±n/a nM
Citation Ivanova, JCarta, FVullo, DLeitans, JKazaks, ATars, K?alubovskis, RSupuran, CT N-Substituted and ring opened saccharin derivatives selectively inhibit transmembrane, tumor-associated carbonic anhydrases IX and XII. Bioorg Med Chem25:3583-3589 (2017) 
 
Carbonic anhydrase 12
Name:Carbonic anhydrase 12
Type:Enzyme
Mol. Mass.:39456.00
Organism:Homo sapiens (Human)
Description:Catalytic domain of human cloned isozyme was used in the assay
Residue:354
BDBM50242151
NameBDBM50242151
Synonyms:CHEMBL4091692
TypeSmall organic molecule
Emp. Form.C11H11NO4S
Mol. Mass.253.274
SMILESCC#CCNS(=O)(=O)c1ccccc1C(O)=O