Reaction Details
TargetCarbonic anhydrase 12
LigandBDBM50242153
Substrate/Competitorn/a
Meas. Tech.ChEMBL_1671364 (CHEMBL4021393)
Ki 34±n/a nM
Citation Ivanova, JCarta, FVullo, DLeitans, JKazaks, ATars, K?alubovskis, RSupuran, CT N-Substituted and ring opened saccharin derivatives selectively inhibit transmembrane, tumor-associated carbonic anhydrases IX and XII. Bioorg Med Chem25:3583-3589 (2017) 
 
Carbonic anhydrase 12
Name:Carbonic anhydrase 12
Type:Enzyme
Mol. Mass.:39456.00
Organism:Homo sapiens (Human)
Description:Catalytic domain of human cloned isozyme was used in the assay
Residue:354
BDBM50242153
NameBDBM50242153
Synonyms:CHEMBL421511
TypeSmall organic molecule
Emp. Form.C12H15NO3S
Mol. Mass.253.317
SMILESCCCCCN1C(=O)c2ccccc2S1(=O)=O