Reaction Details
TargetCarbonic anhydrase 1
LigandBDBM50242152
Substrate/Competitorn/a
Meas. Tech.ChEMBL_1671361 (CHEMBL4021390)
Ki>10000±n/a nM
Citation Ivanova, JCarta, FVullo, DLeitans, JKazaks, ATars, K?alubovskis, RSupuran, CT N-Substituted and ring opened saccharin derivatives selectively inhibit transmembrane, tumor-associated carbonic anhydrases IX and XII. Bioorg Med Chem25:3583-3589 (2017) 
 
Carbonic anhydrase 1
Name:Carbonic anhydrase 1
Type:Enzyme
Mol. Mass.:28873.37
Organism:Homo sapiens (Human)
Description:P00915
Residue:261
BDBM50242152
NameBDBM50242152
Synonyms:CHEMBL4091686
TypeSmall organic molecule
Emp. Form.C9H9NO3S
Mol. Mass.211.238
SMILESCCN1C(=O)c2ccccc2S1(=O)=O