Reaction Details
TargetCarbonic anhydrase 9
LigandBDBM50242148
Substrate/Competitorn/a
Meas. Tech.ChEMBL_1671363 (CHEMBL4021392)
Ki 164±n/a nM
Citation Ivanova, JCarta, FVullo, DLeitans, JKazaks, ATars, K?alubovskis, RSupuran, CT N-Substituted and ring opened saccharin derivatives selectively inhibit transmembrane, tumor-associated carbonic anhydrases IX and XII. Bioorg Med Chem25:3583-3589 (2017) 
 
Carbonic anhydrase 9
Name:Carbonic anhydrase 9
Type:Enzyme
Mol. Mass.:49669.03
Organism:Homo sapiens (Human)
Description:Catalytic domain of human cloned isozyme was used in the assay
Residue:459
BDBM50242148
NameBDBM50242148
Synonyms:CHEMBL79624
TypeSmall organic molecule
Emp. Form.C11H13NO3S
Mol. Mass.239.291
SMILESCCCCN1C(=O)c2ccccc2S1(=O)=O