Reaction Details
TargetMast/stem cell growth factor receptor Kit
LigandBDBM50242166
Substrate/Competitorn/a
Meas. Tech.ChEMBL_1670632 (CHEMBL4020520)
IC50 2.5±n/a nM
Citation Kaitsiotou, HKeul, MHardick, JMühlenberg, TKetzer, JEhrt, CKrüll, JMedda, FKoch, OGiordanetto, FBauer, SRauh, D Inhibitors to Overcome Secondary Mutations in the Stem Cell Factor Receptor KIT. J Med Chem60:8801-8815 (2017) 
 
Mast/stem cell growth factor receptor Kit
Name:Mast/stem cell growth factor receptor Kit
Type:Protein
Mol. Mass.:109869.37
Organism:Homo sapiens (Human)
Description:P10721
Residue:976
BDBM50242166
NameBDBM50242166
Synonyms:CHEMBL4085713
TypeSmall organic molecule
Emp. Form.C29H27F3N6O
Mol. Mass.532.5595
SMILESCN1CCN(Cc2ccc(NC(=O)c3ccc(C)c(c3)C#Cc3ccn4cnnc4c3)cc2C(F)(F)F)CC1