Reaction Details
TargetThromboxane A2 receptor
LigandBDBM50002783
Substrate/Competitorn/a
Meas. Tech.ChEBML_209762
Ki 3.9±n/a nM
Citation Ohshima, ETakami, HSato, HMohri, SObase, HMiki, IIshii, AShirakura, SKarasawa, AKubo, K Non-prostanoid thromboxane A2 receptor antagonists with a dibenzoxepin ring system. 2. J Med Chem35:3402-13 (1992) Thromboxane A2 receptor
Name:Thromboxane A2 receptor
Type:Enyzme
Mol. Mass.:37445.28
Organism:Homo sapiens (Human)
Description:P21731
Residue:343
BDBM50002783
NameBDBM50002783
Synonyms:11-[2-(4,6-Dimethyl-benzoimidazol-1-yl)-ethylidene]-6,11-dihydro-dibenzo[b,e]oxepine-2-carboxylic acid | CHEMBL324965
TypeSmall organic molecule
Emp. Form.C26H22N2O3
Mol. Mass.410.4645
SMILESCc1cc(C)c2ncn(C\C=C3/c4ccccc4COc4ccc(cc34)C(O)=O)c2c1