Reaction Details
TargetAndrogen receptor
LigandBDBM50242299
Substrate/Competitorn/a
Meas. Tech.ChEMBL_1671470 (CHEMBL4021499)
IC50 9.0±n/a nM
Citation Aikawa, KAsano, MOno, KHabuka, NYano, JWilson, KFujita, HKandori, HHara, TMorimoto, MSantou, TYamaoka, MNakayama, MHasuoka, A Synthesis and biological evaluation of novel selective androgen receptor modulators (SARMs) Part III: Discovery of 4-(5-oxopyrrolidine-1-yl)benzonitrile derivative 2f as a clinical candidate. Bioorg Med Chem25:3330-3349 (2017) 
 
Androgen receptor
Name:Androgen receptor
Type:Receptor
Mol. Mass.:99185.27
Organism:Homo sapiens (Human)
Description:CHO cells were stably transfected with human AR gene.
Residue:920
BDBM50242299
NameBDBM50242299
Synonyms:CHEMBL4087902
TypeSmall organic molecule
Emp. Form.C14H15ClN2O2
Mol. Mass.278.734
SMILESCC[C@H]1[C@@H](O)CC(=O)N1c1ccc(C#N)c(Cl)c1C