Reaction Details
TargetAndrogen receptor
LigandBDBM18161
Substrate/Competitorn/a
Meas. Tech.ChEMBL_1671470 (CHEMBL4021499)
IC50 0.670000±n/a nM
Citation Aikawa, KAsano, MOno, KHabuka, NYano, JWilson, KFujita, HKandori, HHara, TMorimoto, MSantou, TYamaoka, MNakayama, MHasuoka, A Synthesis and biological evaluation of novel selective androgen receptor modulators (SARMs) Part III: Discovery of 4-(5-oxopyrrolidine-1-yl)benzonitrile derivative 2f as a clinical candidate. Bioorg Med Chem25:3330-3349 (2017) 
 
Androgen receptor
Name:Androgen receptor
Type:Receptor
Mol. Mass.:99185.27
Organism:Homo sapiens (Human)
Description:CHO cells were stably transfected with human AR gene.
Residue:920
BDBM18161
NameBDBM18161
Synonyms:(1S,2S,7S,10R,11S,14S,15S)-14-hydroxy-2,15-dimethyltetracyclo[8.7.0.0^{2,7}.0^{11,15}]heptadecan-5-one CHEMBL27769 Dihydrotestosterone | [3H]DHT
TypeSteroid
Emp. Form.C19H30O2
Mol. Mass.290.4403
SMILES[H][C@@]12CC[C@H](O)[C@@]1(C)CC[C@@]1([H])[C@@]2([H])CC[C@@]2([H])CC(=O)CC[C@]12C