Reaction Details
TargetSodium channel protein type 5 subunit alpha
LigandBDBM50242501
Substrate/Competitorn/a
Meas. Tech.ChEMBL_1671679 (CHEMBL4021708)
IC50>30000±n/a nM
Citation Pero, JERossi, MALehman, HDGFKelly, MJMulhearn, JJWolkenberg, SECato, MJClements, MKDaley, CJFilzen, TFinger, ENGregan, YHenze, DAJovanovska, AKlein, RKraus, RLLi, YLiang, AMajercak, JMPanigel, JUrban, MOWang, JWang, YHHoughton, AKLayton, ME Benzoxazolinone aryl sulfonamides as potent, selective Na Bioorg Med Chem Lett27:2683-2688 (2017) 
 
Sodium channel protein type 5 subunit alpha
Name:Sodium channel protein type 5 subunit alpha
Type:Enzyme
Mol. Mass.:226908.60
Organism:Homo sapiens (Human)
Description:Q14524
Residue:2016
BDBM50242501
NameBDBM50242501
Synonyms:CHEMBL4060266
TypeSmall organic molecule
Emp. Form.C17H14N4O4S2
Mol. Mass.402.447
SMILESO=C1COc2cc(ccc2N1Cc1ccccc1)S(=O)(=O)Nc1ncns1