Reaction Details
TargetSodium channel protein type 9 subunit alpha
LigandBDBM50242509
Substrate/Competitorn/a
Meas. Tech.ChEMBL_1671680 (CHEMBL4021709)
IC50 21±n/a nM
Citation Pero, JERossi, MALehman, HDGFKelly, MJMulhearn, JJWolkenberg, SECato, MJClements, MKDaley, CJFilzen, TFinger, ENGregan, YHenze, DAJovanovska, AKlein, RKraus, RLLi, YLiang, AMajercak, JMPanigel, JUrban, MOWang, JWang, YHHoughton, AKLayton, ME Benzoxazolinone aryl sulfonamides as potent, selective Na Bioorg Med Chem Lett27:2683-2688 (2017) 
 
Sodium channel protein type 9 subunit alpha
Name:Sodium channel protein type 9 subunit alpha
Type:Protein
Mol. Mass.:226375.97
Organism:Homo sapiens (Human)
Description:Q15858
Residue:1988
BDBM50242509
NameBDBM50242509
Synonyms:CHEMBL4068937
TypeSmall organic molecule
Emp. Form.C20H19N5O4S2
Mol. Mass.457.526
SMILESC[C@H](c1cccc2CCNCc12)n1c2ccc(cc2oc1=O)S(=O)(=O)Nc1ncns1