Reaction Details
TargetEpidermal growth factor receptor
LigandBDBM50242526
Substrate/Competitorn/a
Meas. Tech.ChEMBL_1671751 (CHEMBL4021780)
Ki 900±n/a nM
Citation Fischer, TKrüger, TNajjar, ATotzke, FSchächtele, CSippl, WRitter, CHilgeroth, A Discovery of novel substituted benzo-anellated 4-benzylamino pyrrolopyrimidines as dual EGFR and VEGFR2 inhibitors. Bioorg Med Chem Lett27:2708-2712 (2017) 
 
Epidermal growth factor receptor
Name:Epidermal growth factor receptor
Type:Receptor Kinase Domain
Mol. Mass.:134279.59
Organism:Homo sapiens (Human)
Description:P00533
Residue:1210
BDBM50242526
NameBDBM50242526
Synonyms:CHEMBL4083567
TypeSmall organic molecule
Emp. Form.C18H16ClN5O
Mol. Mass.353.806
SMILESCc1cc2[nH]c3nc(N)nc(NCc4cccc(Cl)c4)c3c2cc1O