Reaction Details
TargetVascular endothelial growth factor receptor 2
LigandBDBM50242527
Substrate/Competitorn/a
Meas. Tech.ChEMBL_1671752 (CHEMBL4021781)
Ki 11070±n/a nM
Citation Fischer, TKrüger, TNajjar, ATotzke, FSchächtele, CSippl, WRitter, CHilgeroth, A Discovery of novel substituted benzo-anellated 4-benzylamino pyrrolopyrimidines as dual EGFR and VEGFR2 inhibitors. Bioorg Med Chem Lett27:2708-2712 (2017) 
 
Vascular endothelial growth factor receptor 2
Name:Vascular endothelial growth factor receptor 2
Type:Receptor Tyrosine Kinase
Mol. Mass.:151510.97
Organism:Homo sapiens (Human)
Description:P35968
Residue:1356
BDBM50242527
NameBDBM50242527
Synonyms:CHEMBL4061797
TypeSmall organic molecule
Emp. Form.C19H19N5O3
Mol. Mass.365.3859
SMILESCOc1ccc(CNc2nc(N)nc3[nH]c4ccc(O)cc4c23)cc1OC