Reaction Details
TargetVascular endothelial growth factor receptor 2
LigandBDBM50242528
Substrate/Competitorn/a
Meas. Tech.ChEMBL_1671752 (CHEMBL4021781)
Ki 4470±n/a nM
Citation Fischer, TKrüger, TNajjar, ATotzke, FSchächtele, CSippl, WRitter, CHilgeroth, A Discovery of novel substituted benzo-anellated 4-benzylamino pyrrolopyrimidines as dual EGFR and VEGFR2 inhibitors. Bioorg Med Chem Lett27:2708-2712 (2017) 
 
Vascular endothelial growth factor receptor 2
Name:Vascular endothelial growth factor receptor 2
Type:Receptor Tyrosine Kinase
Mol. Mass.:151510.97
Organism:Homo sapiens (Human)
Description:P35968
Residue:1356
BDBM50242528
NameBDBM50242528
Synonyms:CHEMBL4060727
TypeSmall organic molecule
Emp. Form.C18H17N5O
Mol. Mass.319.3605
SMILESNc1nc(NCCc2ccccc2)c2c(n1)[nH]c1ccc(O)cc21