Reaction Details
TargetEpidermal growth factor receptor
LigandBDBM50242542
Substrate/Competitorn/a
Meas. Tech.ChEMBL_1671751 (CHEMBL4021780)
Ki 370±n/a nM
Citation Fischer, TKrüger, TNajjar, ATotzke, FSchächtele, CSippl, WRitter, CHilgeroth, A Discovery of novel substituted benzo-anellated 4-benzylamino pyrrolopyrimidines as dual EGFR and VEGFR2 inhibitors. Bioorg Med Chem Lett27:2708-2712 (2017) 
 
Epidermal growth factor receptor
Name:Epidermal growth factor receptor
Type:Receptor Kinase Domain
Mol. Mass.:134279.59
Organism:Homo sapiens (Human)
Description:P00533
Residue:1210
BDBM50242542
NameBDBM50242542
Synonyms:CHEMBL4069965
TypeSmall organic molecule
Emp. Form.C17H14BrN5O
Mol. Mass.384.23
SMILESNc1nc(NCc2ccccc2)c2c(n1)[nH]c1cc(Br)c(O)cc21