Reaction Details
TargetProtein mono-ADP-ribosyltransferase PARP14
LigandBDBM50242652
Substrate/Competitorn/a
Meas. Tech.ChEMBL_1672032 (CHEMBL4022061)
IC50 2400±n/a nM
Citation Upton, KMeyers, MThorsell, AGKarlberg, THolechek, JLease, RSchey, GWolf, ELucente, ASchüler, HFerraris, D Design and synthesis of potent inhibitors of the mono(ADP-ribosyl)transferase, PARP14. Bioorg Med Chem Lett27:2907-2911 (2017) 
 
Protein mono-ADP-ribosyltransferase PARP14
Name:Protein mono-ADP-ribosyltransferase PARP14
Type:n/a
Mol. Mass.:202812.41
Organism:Homo sapiens (Human)
Description:Q460N5
Residue:1801
BDBM50242652
NameBDBM50242652
Synonyms:CHEMBL4084742
TypeSmall organic molecule
Emp. Form.C20H25N3O5
Mol. Mass.387.4296
SMILESCCOC(=O)CC1CCN(CC1)C(=O)\C=C/C(=O)Nc1cccc(c1)C(N)=O