Reaction Details
TargetProtein mono-ADP-ribosyltransferase PARP14
LigandBDBM50242631
Substrate/Competitorn/a
Meas. Tech.ChEMBL_1672032 (CHEMBL4022061)
IC50 160±n/a nM
Citation Upton, KMeyers, MThorsell, AGKarlberg, THolechek, JLease, RSchey, GWolf, ELucente, ASchüler, HFerraris, D Design and synthesis of potent inhibitors of the mono(ADP-ribosyl)transferase, PARP14. Bioorg Med Chem Lett27:2907-2911 (2017) 
 
Protein mono-ADP-ribosyltransferase PARP14
Name:Protein mono-ADP-ribosyltransferase PARP14
Type:n/a
Mol. Mass.:202812.41
Organism:Homo sapiens (Human)
Description:Q460N5
Residue:1801
BDBM50242631
NameBDBM50242631
Synonyms:CHEMBL4068366
TypeSmall organic molecule
Emp. Form.C21H21ClN4O3
Mol. Mass.412.869
SMILESNC(=O)c1cccc(NC(=O)\C=C/C(=O)N2CCN(CC2)c2ccc(Cl)cc2)c1