Reaction Details
TargetSerine/threonine-protein kinase mTOR
LigandBDBM25045
Substrate/Competitorn/a
Meas. Tech.ChEBML_1672555
IC50 20±n/a nM
Citation Al-Ashmawy, AAKRagab, FAElokely, KMAnwar, MMPerez-Leal, ORico, MCGordon, JBichenkov, EMateo, GKassem, EMMHegazy, GHAbou-Gharbia, MChilders, W Design, synthesis and SAR of new-di-substituted pyridopyrimidines as ATP-competitive dual PI3K?/mTOR inhibitors. Bioorg Med Chem Lett27:3117-3122 (2017) 
 
Serine/threonine-protein kinase mTOR
Name:Serine/threonine-protein kinase mTOR
Type:Rapamycin target protein
Mol. Mass.:288917.12
Organism:Homo sapiens (Human)
Description:P42345
Residue:2549
BDBM25045
NameBDBM25045
Synonyms:3-(4-morpholin-4-ylpyrido[2,3]furo[2,4-b]pyrimidin-2-yl)phenol 3-(4-morpholinopyrido[2,3]furo[2,4-b]pyrimidin-2-yl)phenol 3-[6-(morpholin-4-yl)-8-oxa-3,5,10-triazatricyclo[7.4.0.0^{2,7}]trideca-1(9),2,4,6,10,12-hexaen-4-yl]phenol PI-103 cid_9884685 pyridofuropyrimidine derivative, 2
TypeSmall organic molecule
Emp. Form.C19H16N4O3
Mol. Mass.348.3553
SMILESOc1cccc(c1)-c1nc(N2CCOCC2)c2oc3ncccc3c2n1