Reaction Details
TargetMuscarinic acetylcholine receptor M1
LigandBDBM50003357
Substrate/Competitorn/a
Meas. Tech.ChEMBL_138799 (CHEMBL751535)
IC50 17±n/a nM
Citation Ward, JSMerritt, LKlimkowski, VJLamb, MLMitch, CHBymaster, FPSawyer, BShannon, HEOlesen, PHHonoré, T Novel functional M1 selective muscarinic agonists. 2. Synthesis and structure-activity relationships of 3-pyrazinyl-1,2,5,6-tetrahydro-1-methylpyridines. Construction of a molecular model for the M1 pharmacophore. J Med Chem35:4011-9 (1992) Muscarinic acetylcholine receptor M1
Name:Muscarinic acetylcholine receptor M1
Type:Enzyme Catalytic Domain
Mol. Mass.:51390.46
Organism:RAT
Description:P08482
Residue:460
BDBM50003357
NameBDBM50003357
Synonyms:2-Butoxy-3-(1-methyl-1,2,5,6-tetrahydro-pyridin-3-yl)-pyrazine | CHEMBL128401
TypeSmall organic molecule
Emp. Form.C14H21N3O
Mol. Mass.247.336
SMILESCCCCOc1nccnc1C1=CCCN(C)C1