Reaction Details
TargetMuscarinic acetylcholine receptor M1
LigandBDBM50003352
Substrate/Competitorn/a
Meas. Tech.ChEMBL_138799 (CHEMBL751535)
IC50 28±n/a nM
Citation Ward, JSMerritt, LKlimkowski, VJLamb, MLMitch, CHBymaster, FPSawyer, BShannon, HEOlesen, PHHonoré, T Novel functional M1 selective muscarinic agonists. 2. Synthesis and structure-activity relationships of 3-pyrazinyl-1,2,5,6-tetrahydro-1-methylpyridines. Construction of a molecular model for the M1 pharmacophore. J Med Chem35:4011-9 (1992) Muscarinic acetylcholine receptor M1
Name:Muscarinic acetylcholine receptor M1
Type:Enzyme Catalytic Domain
Mol. Mass.:51390.46
Organism:RAT
Description:P08482
Residue:460
BDBM50003352
NameBDBM50003352
Synonyms:2-Hexylsulfanyl-3-(1-methyl-1,2,5,6-tetrahydro-pyridin-3-yl)-pyrazine | CHEMBL131587
TypeSmall organic molecule
Emp. Form.C16H25N3S
Mol. Mass.291.455
SMILESCCCCCCSc1nccnc1C1=CCCN(C)C1