Reaction Details
TargetMuscarinic acetylcholine receptor M1
LigandBDBM50003350
Substrate/Competitorn/a
Meas. Tech.ChEMBL_138802 (CHEMBL751537)
IC50 187±n/a nM
Citation Ward, JSMerritt, LKlimkowski, VJLamb, MLMitch, CHBymaster, FPSawyer, BShannon, HEOlesen, PHHonoré, T Novel functional M1 selective muscarinic agonists. 2. Synthesis and structure-activity relationships of 3-pyrazinyl-1,2,5,6-tetrahydro-1-methylpyridines. Construction of a molecular model for the M1 pharmacophore. J Med Chem35:4011-9 (1992) Muscarinic acetylcholine receptor M1
Name:Muscarinic acetylcholine receptor M1
Type:Enzyme Catalytic Domain
Mol. Mass.:51390.46
Organism:RAT
Description:P08482
Residue:460
BDBM50003350
NameBDBM50003350
Synonyms:5-(4-Heptyl-[1,2,5]thiadiazol-3-yl)-1-methyl-1,2,3,6-tetrahydro-pyridine CHEMBL120399 | CHEMBL307837
TypeSmall organic molecule
Emp. Form.C15H25N3S
Mol. Mass.279.444
SMILESCCCCCCCc1nsnc1C1=CCCN(C)C1