Reaction Details
TargetFolylpolyglutamate synthase, mitochondrial
LigandBDBM50003468
Substrate/Competitorn/a
Meas. Tech.ChEBML_68691
Ki 500±n/a nM
Citation Hynes, JBSingh, SKFetzer, OShane, B Inhibition of hog liver folylpolyglutamate synthetase by 5-substituted 5,8-dideaza analogues of folic acid bearing a terminal L-ornithine residue. J Med Chem35:4078-85 (1992) Folylpolyglutamate synthase, mitochondrial
Name:Folylpolyglutamate synthase, mitochondrial
Type:PROTEIN
Mol. Mass.:64621.95
Organism:Homo sapiens (Human)
Description:ChEMBL_68676
Residue:587
BDBM50003468
NameBDBM50003468
Synonyms:5-Amino-2-{4-[(2-amino-5-chloro-4-oxo-3,4-dihydro-quinazolin-6-ylamino)-methyl]-benzoylamino}-pentanoic acid | CHEMBL335629
TypeSmall organic molecule
Emp. Form.C21H23ClN6O4
Mol. Mass.458.898
SMILESNCCCC(NC(=O)c1ccc(CNc2ccc3nc(N)[nH]c(=O)c3c2Cl)cc1)C(O)=O