Reaction Details
TargetFolylpolyglutamate synthase, mitochondrial
LigandBDBM50003470
Substrate/Competitorn/a
Meas. Tech.ChEBML_68691
Ki 150±n/a nM
Citation Hynes, JBSingh, SKFetzer, OShane, B Inhibition of hog liver folylpolyglutamate synthetase by 5-substituted 5,8-dideaza analogues of folic acid bearing a terminal L-ornithine residue. J Med Chem35:4078-85 (1992) Folylpolyglutamate synthase, mitochondrial
Name:Folylpolyglutamate synthase, mitochondrial
Type:PROTEIN
Mol. Mass.:64621.95
Organism:Homo sapiens (Human)
Description:ChEMBL_68676
Residue:587
BDBM50003470
NameBDBM50003470
Synonyms:5-Amino-2-{4-[(5-fluoro-2-methyl-4-oxo-3,4-dihydro-quinazolin-6-ylamino)-methyl]-benzoylamino}-pentanoic acid | CHEMBL339240
TypeSmall organic molecule
Emp. Form.C22H24FN5O4
Mol. Mass.441.4555
SMILESCc1nc2ccc(NCc3ccc(cc3)C(=O)NC(CCCN)C(O)=O)c(F)c2c(=O)[nH]1