Reaction Details
TargetFolylpolyglutamate synthase, mitochondrial
LigandBDBM50003471
Substrate/Competitorn/a
Meas. Tech.ChEBML_68691
Ki 11±n/a nM
Citation Hynes, JBSingh, SKFetzer, OShane, B Inhibition of hog liver folylpolyglutamate synthetase by 5-substituted 5,8-dideaza analogues of folic acid bearing a terminal L-ornithine residue. J Med Chem35:4078-85 (1992) Folylpolyglutamate synthase, mitochondrial
Name:Folylpolyglutamate synthase, mitochondrial
Type:PROTEIN
Mol. Mass.:64621.95
Organism:Homo sapiens (Human)
Description:ChEMBL_68676
Residue:587
BDBM50003471
NameBDBM50003471
Synonyms:5-Amino-2-{4-[(2-amino-4-oxo-5-trifluoromethyl-3,4-dihydro-quinazolin-6-ylamino)-methyl]-benzoylamino}-pentanoic acid | CHEMBL133637
TypeSmall organic molecule
Emp. Form.C22H23F3N6O4
Mol. Mass.492.451
SMILESNCCCC(NC(=O)c1ccc(CNc2ccc3nc(N)[nH]c(=O)c3c2C(F)(F)F)cc1)C(O)=O