Reaction Details
TargetBcl-2-like protein 1
LigandBDBM50244145
Substrate/Competitorn/a
Meas. Tech.ChEMBL_1673174 (CHEMBL4023203)
Ki>36000±n/a nM
Citation Shaw, SBian, ZZhao, BTarr, JCVeerasamy, NJeon, KOBelmar, JArnold, ALFogarty, SAPerry, ESensintaffar, JLCamper, DVRossanese, OWLee, TOlejniczak, ETFesik, SW Optimization of Potent and Selective Tricyclic Indole Diazepinone Myeloid Cell Leukemia-1 Inhibitors Using Structure-Based Design. J Med Chem61:2410-2421 (2018) 
 
Bcl-2-like protein 1
Name:Bcl-2-like protein 1
Type:Mitochondrion membrane; Single-pass membrane protein
Mol. Mass.:26039.60
Organism:Homo sapiens (Human)
Description:n/a
Residue:233
BDBM50244145
NameBDBM50244145
Synonyms:CHEMBL4101866 US11208415, Example I-108
TypeSmall organic molecule
Emp. Form.C39H37Cl2N5O4
Mol. Mass.710.648
SMILESCc1nn(C)c(C)c1-c1c(Cl)ccc2c(CCCOc3cc(C)c(Cl)c(C)c3)c3C(=O)N(CCCn3c12)c1ccc(C(O)=O)c2cccnc12