Reaction Details
TargetMetabotropic glutamate receptor 2
LigandBDBM50244204
Substrate/Competitorn/a
Meas. Tech.ChEMBL_1673191 (CHEMBL4023220)
EC50 8.4±n/a nM
Citation Monn, JAHenry, SSMassey, SMClawson, DKChen, QDiseroad, BABhardwaj, RMAtwell, SLu, FWang, JRussell, MHeinz, BAWang, XSCarter, JHGetman, BGAdragni, KBroad, LMSanger, HEUrsu, DCatlow, JTSwanson, SJohnson, BGShaw, DBMcKinzie, DLHao, J Synthesis and Pharmacological Characterization of C4 J Med Chem61:2303-2328 (2018) 
 
Metabotropic glutamate receptor 2
Name:Metabotropic glutamate receptor 2
Type:Enzyme
Mol. Mass.:95584.88
Organism:Homo sapiens (Human)
Description:Q14416
Residue:872
BDBM50244204
NameBDBM50244204
Synonyms:CHEMBL4071962
TypeSmall organic molecule
Emp. Form.C15H15ClN2O5
Mol. Mass.338.743
SMILES[H][C@]12[C@H](C(O)=O)[C@@]1([H])[C@@](N)(C[C@@H]2NC(=O)c1cccc(Cl)c1)C(O)=O