Reaction Details
TargetMetabotropic glutamate receptor 3
LigandBDBM50244219
Substrate/Competitorn/a
Meas. Tech.ChEMBL_1673189 (CHEMBL4023218)
Ki 0.927000±n/a nM
Citation Monn, JAHenry, SSMassey, SMClawson, DKChen, QDiseroad, BABhardwaj, RMAtwell, SLu, FWang, JRussell, MHeinz, BAWang, XSCarter, JHGetman, BGAdragni, KBroad, LMSanger, HEUrsu, DCatlow, JTSwanson, SJohnson, BGShaw, DBMcKinzie, DLHao, J Synthesis and Pharmacological Characterization of C4 J Med Chem61:2303-2328 (2018) 
 
Metabotropic glutamate receptor 3
Name:Metabotropic glutamate receptor 3
Type:Enzyme Catalytic Domain
Mol. Mass.:98889.09
Organism:Homo sapiens (Human)
Description:metabotropic glutamate 1c 0 HUMAN::Q14832
Residue:879
BDBM50244219
NameBDBM50244219
Synonyms:CHEMBL4081453
TypeSmall organic molecule
Emp. Form.C16H18N2O6
Mol. Mass.334.3239
SMILES[H][C@]12[C@H](C(O)=O)[C@@]1([H])[C@@](N)(C[C@@H]2NC(=O)c1cccc(OC)c1)C(O)=O