Reaction Details
TargetTyrosine-protein kinase BTK
LigandBDBM50244502
Substrate/Competitorn/a
Meas. Tech.ChEMBL_1673668 (CHEMBL4023697)
Ki 0.650000±n/a nM
Citation Crawford, JJJohnson, ARMisner, DLBelmont, LDCastanedo, GChoy, RCoraggio, MDong, LEigenbrot, CErickson, RGhilardi, NHau, JKatewa, AKohli, PBLee, WLubach, JWMcKenzie, BSOrtwine, DFSchutt, LTay, SWei, BReif, KLiu, LWong, HYoung, WB Discovery of GDC-0853: A Potent, Selective, and Noncovalent Bruton's Tyrosine Kinase Inhibitor in Early Clinical Development. J Med Chem61:2227-2245 (2018) 
 
Tyrosine-protein kinase BTK
Name:Tyrosine-protein kinase BTK
Type:Enzyme
Mol. Mass.:76289.95
Organism:Homo sapiens (Human)
Description:Q06187
Residue:659
BDBM50244502
NameBDBM50244502
Synonyms:CHEMBL4085043
TypeSmall organic molecule
Emp. Form.C35H40FN7O3
Mol. Mass.625.7356
SMILESC[C@H]1CN(C)CCN1c1ccc(Nc2cc(cn(C)c2=O)-c2cc(F)cc(N3CCn4c5CCCCc5cc4C3=O)c2CO)nc1