Reaction Details
TargetApelin receptor
LigandBDBM50244576
Substrate/Competitorn/a
Meas. Tech.ChEMBL_1673874 (CHEMBL4023903)
Ki 1.4±n/a nM
Citation Trân, KMurza, ASainsily, XCoquerel, DCôté, JBelleville, KHaroune, LLongpré, JMDumaine, RSalvail, DLesur, OAuger-Messier, MSarret, PMarsault, É A Systematic Exploration of Macrocyclization in Apelin-13: Impact on Binding, Signaling, Stability, and Cardiovascular Effects. J Med Chem61:2266-2277 (2018) 
 
Apelin receptor
Name:Apelin receptor
Type:Enzyme Catalytic Domain
Mol. Mass.:42664.06
Organism:Homo sapiens (Human)
Description:P35414
Residue:380
BDBM50244576
NameBDBM50244576
Synonyms:CHEMBL4078407
TypeSmall organic molecule
Emp. Form.C66H102N20O16
Mol. Mass.1431.6405
SMILESCC(C)C[C@H](NC(=O)[C@H](CCCNC(N)=N)NC(=O)[C@@H]1CCCN1C(=O)[C@H](CCCNC(N)=N)NC(=O)[C@@H]1CCC(=O)N1)C(=O)N[C@@H](CO)C(=O)N[C@H]1C\C=C/C[C@H](NC(=O)[C@@H]2CCCN2C(=O)CNC(=O)[C@H](CCCCN)NC1=O)C(=O)N1CCC[C@H]1C(=O)N[C@@H](Cc1ccccc1)C(O)=O