Reaction Details
TargetApelin receptor
LigandBDBM50244579
Substrate/Competitorn/a
Meas. Tech.ChEMBL_1673874 (CHEMBL4023903)
Ki 0.150000±n/a nM
Citation Trân, KMurza, ASainsily, XCoquerel, DCôté, JBelleville, KHaroune, LLongpré, JMDumaine, RSalvail, DLesur, OAuger-Messier, MSarret, PMarsault, É A Systematic Exploration of Macrocyclization in Apelin-13: Impact on Binding, Signaling, Stability, and Cardiovascular Effects. J Med Chem61:2266-2277 (2018) 
 
Apelin receptor
Name:Apelin receptor
Type:Enzyme Catalytic Domain
Mol. Mass.:42664.06
Organism:Homo sapiens (Human)
Description:P35414
Residue:380
BDBM50244579
NameBDBM50244579
Synonyms:CHEMBL4094033
TypeSmall organic molecule
Emp. Form.C75H116N24O20S
Mol. Mass.1705.937
SMILESCCCC[C@@H]1NC(=O)[C@@H]2CCCN2C(=O)[C@H](CCN(C\C=C/C[C@H](NC(=O)[C@@H]2CCCN2C1=O)C(O)=O)S(=O)(=O)c1ccccc1[N+]([O-])=O)NC(=O)[C@H](CCCCN)NC(=O)[C@H](Cc1cnc[nH]1)NC(=O)[C@H](CO)NC(=O)[C@H](CC(C)C)NC(=O)[C@H](CCCNC(N)=N)NC(=O)[C@@H]1CCCN1C(=O)[C@H](CCCNC(N)=N)NC(=O)[C@@H]1CCC(=O)N1